{"text_format":"1","workbook":"xlsx","n_sheets":8,"sheets":["Disclaimer","Pause","Inputs","Assumptions","Contributions & benefits at NRA","Output","PDF","Accrued benefits"],"not_rendered":{"charts":0,"images":4,"macros":1,"external_links":0,"defined_names":2,"comments":1,"pivot_tables":0},"unopened":[],"bounds":{"document_bytes":16777216,"sheet_cells":100000,"rows_first":2000,"rows_last":500,"rows_between":2000,"halvings":0,"cell_chars":16384,"cell_head_chars":4096},"cells_cut":0,"cells_raw":0,"read":"whole","date_system":"1900"}

{"sheet":"Disclaimer","index":0,"n_rows":27,"n_cols":4,"rows_kept":27,"cut":false,"hidden":false,"merged":[[24,1,24,5],[6,1,6,5],[9,1,9,5],[8,1,8,5],[11,1,11,5],[12,1,12,5],[14,1,14,5],[18,1,20,5]]}
[]
[]
[]
[]
[]
[]
[null,"Welcome to the Single Public Service Pension Scheme Estimator for Primary Teachers!"]
[]
[null,"Our pension estimator is designed exclusively for teachers in the Single Public Service Pension Scheme "]
[null,"(generally those who entered teaching from 1st January 2013 onwards)."]
{"$rows_left_out":18}
{"sheet":"Pause","index":1,"n_rows":0,"n_cols":0,"rows_kept":0,"cut":false,"hidden":false,"merged":[]}

{"sheet":"Inputs","index":2,"n_rows":77,"n_cols":28,"rows_kept":77,"cut":false,"hidden":false,"merged":[[13,0,13,1],[0,3,0,7],[0,16,0,19],[0,21,0,23],[1,0,1,1],[1,3,1,4],[1,6,1,7],[1,9,1,10],[0,9,0,10]]}
[null,null,null,"Salary Scale",null,null,null,null,null,"Other Allowances",null,null,"Purchase of Retirement Benefits Scheme: Purchase Rates",null,null,null,"Early Retirement Reduction Factors",null,null,null,null,"Historic Accrued Entitlements"]
["Inputs",null,null,"Original Salary Scale",null,null,"Altered Scale- 4, 8 & 12 omitted",null,null,"Specified Allowances",null,null,"Age Next Birthday","Cost of purchasing €1 Pension p.a. from age 66","Cost of purchasing €1 Lump-sum from age 66",null,"NRA","Age at Early Retirement","Pension Reduction Factor","Lump Sum Reduction Factor",null,"Year of Joining","Estimated Accrued Pension to 31/12/2020","Estimated Accrued Lump Sum to 31/12/2020"]
["Date of Birth","1992-05-06",null,"Point","€",null,"Point","€",null,"Category","€",null,66,23.89,1,null,66,60,0.81,0.98,null,2013,1647.5426985914589,10652.215723651674]
["Teacher Start Date","2013-09-01",null,1,{"$f":"37692","v":37692},null,1,{"$f":"E4","v":37692},null,"Teachers with 35 years' service",2446,null,65,23.92,1,null,null,null,null,null,null,2014,1403.1756279752246,9072.2562153570561]
["Current Point on Salary Scale",10,null,2,{"$f":"39235","v":39235},null,{"$f":"G4+1","v":2},{"$f":"E5","v":39235},null,null,null,null,64,23.96,1,null,null,null,null,null,null,2015,1184.2754227825742,7656.9531645425059]
["Current Full Time/Part-Time %",1,null,3,{"$f":"40996","v":40996},null,3,{"$f":"E6","v":40996},null,null,null,null,63,24,0.99,null,null,null,null,null,null,2016,966.37557754960903,6248.1179582948853]
["Current Value of AVCs",0,null,4,{"$f":"41800","v":41800},null,{"$f":"G6+2","v":5},{"$f":"E8","v":42932},null,null,null,null,62,24.03,0.99,null,null,null,null,null,null,2017,745.1130950875654,4817.5415630661555]
["Post of Responsibility",0,null,5,{"$f":"42932","v":42932},null,6,{"$f":"E9","v":44299},null,null,null,null,61,24.07,0.99,null,null,null,null,null,null,2018,513.60944350447016,3320.7507123133855]
["Other Allowances",0,null,6,{"$f":"44299","v":44299},null,7,45834,null,null,null,null,60,24.1,0.99,null,null,null,null,null,null,2019,290.05866848693472,1875.3793221138023]
[null,null,null,7,{"$f":"45834","v":45834},null,{"$f":"G9+2","v":9},{"$f":"E12","v":48671},null,null,null,null,59,24.14,0.98,null,null,null,null,null,null,2020,72.752164377230542,470.38037312864577]
{"$rows_left_out":68}
{"sheet":"Assumptions","index":3,"n_rows":10,"n_cols":7,"rows_kept":10,"cut":false,"hidden":false,"merged":[[0,0,0,1]]}
["Assumptions",null,null,"ILIM Balanced Fund",null,{"$f":"DATE(2020,1,31)","v":"2020-01-31"}]
["Benefit Deflation p.a.",1.4999999999999999E-2,null,null,"Asset Split","SAI Assumption","Assumed Return"]
["Salary Inflation (above increments) p.a.",1.4999999999999999E-2,null,"Equities",0.60899999999999999,4.4999999999999998E-2,{"$f":"F3*E3","v":2.7404999999999999E-2}]
["State Pension Increases p.a.",{"$f":"B3","v":1.4999999999999999E-2},null,"Fixed Interest",0.313,{"$f":"1%","v":0.01},{"$f":"F4*E4","v":3.13E-3}]
["Pre Retirement Investment Return p.a. > 9 years to NRA",{"$f":"G8","v":3.3729999999999996E-2},null,"Property",7.0999999999999994E-2,{"$f":"F3","v":4.4999999999999998E-2},3.1949999999999995E-3]
["Pre Retirement Investment Return p.a. <= 1 year to NRA",0,null,"Cash",7.0000000000000001E-3,{"$f":"0%","v":0},0]
["Pre Retirement Investment Return p.a. < 9 years to NRA","Proportionately reducing from point 5 to point 6 above",null,"Alternatives",0,null,0]
["AMC","1% < €40k, 0.75% from €40k - €140k, 0.5% > €140k",null,"Total",{"$f":"SUM(E3:E7)","v":0.99999999999999989},null,{"$f":"SUM(G3:G7)","v":3.3729999999999996E-2}]
["Allocation Rate",1]
["AVC Set Up Fee Year 1 only",{"$f":"595","v":595}]
{"$rows_left_out":1}
{"sheet":"Contributions & benefits at NRA","index":4,"n_rows":69,"n_cols":30,"rows_kept":69,"cut":false,"hidden":false,"merged":[]}
[null,null,null,null,null,null,null,null,null,null,null,null,null,"Early Retirement Reduction Factors"]
[null,null,null,null,null,null,null,null,null,null,"Current Date",{"$f":"TODAY()","v":"2021-05-20"},null,null,"Pension","Lump Sum"]
[null,null,null,null,null,null,null,null,null,null,"NRA",{"$f":"66","v":66},null,60,{"$f":"VLOOKUP($L$3,Inputs!$Q$3:$T$5,3,FALSE)","v":0.81},{"$f":"VLOOKUP($L$3,Inputs!$Q$3:$T$5,4,FALSE)","v":0.98}]
[null,null,null,null,null,null,null,null,null,null,"NRA less 1 Year",{"$f":"L3-1","v":65}]
[null,"Point on scale","Salary Scale","Posts of Responsibility Allowance - Multiplier 26.09","Other Allowances - Multiplier 26.09","Teachers with 34 years' service Allowance","Total Pensionable Salary","AVCs (fortnightly)",null,null,"Age","Service","Total Pensionable Salary with salary growth","State pension","3.74* State pension","Annual pension accrual","Annual lump sum accrual","Cumulative pension","Cumulative lump sum","Existing AVC Fund","Future AVCs (fortnightly)",null,null,"AMC","Investment Return","Assumed Investment Return (less AMC)",null,"Age next birthday","Pension Purchase Rates","Lump Sum Purchase Rates"]
["Starting position",null,null,null,null,null,null,null,null,null,null,null,null,null,null,null,null,{"$f":"IFERROR(VLOOKUP(YEAR(Inputs!$B$4),Inputs!$V$3:$X$10,2,FALSE)*Inputs!$B$6,0)","v":1647.5426985914589},{"$f":"IFERROR(VLOOKUP(YEAR(Inputs!$B$4),Inputs!$V$3:$X$10,3,FALSE)*Inputs!$B$6,0)","v":10652.215723651674},{"$f":"Inputs!B7","v":0}]
[null,{"$f":"Inputs!B5","v":10},{"$f":"VLOOKUP(B7,Inputs!$G$4:$H$77,2,FALSE)","v":50977},{"$f":"Inputs!$B$8*26.09","v":0},{"$f":"Inputs!$B$9*26.09","v":0},{"$f":"IF(L7>=34,Inputs!$K$4,0)","v":0},{"$f":"SUM(C7:F7)","v":50977},{"$f":"Inputs!$B$12*26.09*((12-MONTH(TODAY()))/12)*Assumptions!$B$9*M7/$G$7","v":608.76666666666665},null,null,{"$f":"((MAX(YEARFRAC(Inputs!B3,Inputs!B15,0),YEARFRAC(Inputs!B3,Inputs!B4,0))))","v":28.652777777777779},{"$f":"((MAX(YEARFRAC(Inputs!B4,Inputs!B15,0),YEARFRAC(Inputs!B4,Inputs!B4,0))))","v":7.333333333333333},{"$f":"IFERROR((G7)*(1+Assumptions!$B$3)^(K7-K$7),0)","v":50977},{"$f":"IFERROR(Inputs!$B$19*52.18*(1+Assumptions!$B$4)^(K7-K$7),0)","v":12956.294},{"$f":"N7*3.74","v":48456.539560000005},{"$f":"IFERROR((MIN(M7,O7)*Inputs!$B$16+MAX(0,M7-O7)*Inputs!$B$17)*Inputs!$B$6,0)","v":312.55368494799995},{"$f":"IFERROR((M7*Inputs!$B$18*Inputs!$B$6),0)","v":1911.6374999999998},{"$f":"IFERROR(R6+P7*(K8-K7),0)","v":1756.0682836428475},{"$f":"IFERROR(S6+Q7*(K8-K7),0)","v":11315.978744485006},{"$f":"T6*(1+Z6)","v":0},{"$f":"H7-IF($T$6>0,0,Assumptions!$B$10)","v":13.766666666666652},null,null,{"$f":"(0.01*MIN(T7+U7,40000)+0.0075*MIN(MAX(T7+U7-40000,0),100000)+0.005*(MAX(T7+U7-140000,0)))/(T7+U7)","v":0.01},{"$f":"MAX(IF(($L$4-K7)>=9,((1+Assumptions!$B$5)-1),((1+Assumptions!$B$5)-1)*($L$4-K7)/9+((1+Assumptions!$B$6)-1)*(1-($L$4-K7)/9)),0)","v":3.3730000000000038E-2},{"$f":"((1+Y7)*(1-X7)-1)*((12-MONTH(TODAY()))/12)","v":1.3645741666666693E-2},null,{"$f":"ROUNDUP(YEARFRAC(Inputs!B3,TODAY(),0),0)","v":30},{"$f":"VLOOKUP(AB7,Inputs!$M$3:$O$48,2,FALSE)","v":25.2},{"$f":"VLOOKUP(AB7,Inputs!$M$3:$O$48,3,FALSE)","v":0.92}]
[null,{"$f":"MIN(IF(B7+1=4,5,IF(B7+1=8,9,IF(B7+1=12,13,B7+1))),Inputs!$G$31)","v":11},{"$f":"VLOOKUP(B8,Inputs!$G$4:$H$77,2,FALSE)","v":52410},{"$f":"Inputs!$B$8*26.09","v":0},{"$f":"Inputs!$B$9*26.09","v":0},{"$f":"IF(L8>=34,Inputs!$K$4,0)","v":0},{"$f":"SUM(C8:F8)","v":52410},{"$f":"Inputs!$B$12*26.09*Assumptions!$B$9*M8/$G$7","v":1078.4974188866252},null,null,{"$f":"IFERROR(IF(K7>=$L$3,\"\",INT(K7)+1),\"\")","v":29},{"$f":"L7+K8-K7","v":7.6805555555555571},{"$f":"IFERROR((G8)*(1+Assumptions!$B$3)^(K8-K$7),0)","v":52681.643275760347},{"$f":"IFERROR(Inputs!$B$19*52.18*(1+Assumptions!$B$4)^(K8-K$7),0)","v":13023.447026977183},{"$f":"N8*3.74","v":48707.691880894665},{"$f":"IFERROR((MIN(M8,O8)*Inputs!$B$16+MAX(0,M8-O8)*Inputs!$B$17)*Inputs!$B$6,0)","v":332.17900534501007},{"$f":"IFERROR((M8*Inputs!$B$18*Inputs!$B$6),0)","v":1975.5616228410129},{"$f":"IFERROR(R7*(1+Assumptions!$B$2)+P8,0)","v":2114.5883132425001},{"$f":"IFERROR(S7*(1+Assumptions!$B$2)+Q8,0)","v":13461.280048493292},{"$f":"T7*(1+Z7*(1-K7/K8))","v":0},{"$f":"U7*(1+$Z7)+H8*(1+$Z7)^0.5","v":1099.785457468018},null,null,{"$f":"(0.01*MIN(T8+U8,40000)+0.0075*MIN(MAX(T8+U8-40000,0),100000)+0.005*(MAX(T8+U8-140000,0)))/(T8+U8)","v":0.01},{"$f":"MAX(IF(($L$4-K8)>=9,((1+Assumptions!$B$5)-1),((1+Assumptions!$B$5)-1)*($L$4-K8)/9+((1+Assumptions!$B$6)-1)*(1-($L$4-K8)/9)),0)","v":3.3730000000000038E-2},{"$f":"(1+Y8)*(1-X8)-1","v":2.3392700000000044E-2}]
[null,{"$f":"MIN(IF(B8+1=4,5,IF(B8+1=8,9,IF(B8+1=12,13,B8+1))),Inputs!$G$31)","v":13},{"$f":"VLOOKUP(B9,Inputs!$G$4:$H$77,2,FALSE)","v":55828},{"$f":"Inputs!$B$8*26.09","v":0},{"$f":"Inputs!$B$9*26.09","v":0},{"$f":"IF(L9>=34,Inputs!$K$4,0)","v":0},55828,{"$f":"Inputs!$B$12*26.09*Assumptions!$B$9*M9/$G$7","v":1166.065812061182},null,null,{"$f":"IFERROR(IF(K8>=$L$3,\"\",K8+1),\"\")","v":30},{"$f":"L8+K9-K8","v":8.6805555555555571},{"$f":"IFERROR((G9)*(1+Assumptions!$B$3)^(K9-K$7),0)","v":56959.119299964426},{"$f":"IFERROR(Inputs!$B$19*52.18*(1+Assumptions!$B$4)^(K9-K$7),0)","v":13218.79873238184},49438.307259108085,{"$f":"IFERROR((MIN(M9,O9)*Inputs!$B$16+MAX(0,M9-O9)*Inputs!$B$17)*Inputs!$B$6,0)","v":380.75233261353111},{"$f":"IFERROR((M9*Inputs!$B$18*Inputs!$B$6),0)","v":2135.9669737486661},{"$f":"IFERROR(R8*(1+Assumptions!$B$2)+P9,0)","v":2527.0594705546687},{"$f":"IFERROR(S8*(1+Assumptions!$B$2)+Q9,0)","v":15799.166222969356},{"$f":"T8*(1+Z8)","v":0},{"$f":"U8*(1+$Z8)+H9*(1+$Z8)^0.5","v":2305.1380925748108},null,null,0.01,{"$f":"MAX(IF(($L$4-K9)>=9,((1+Assumptions!$B$5)-1),((1+Assumptions!$B$5)-1)*($L$4-K9)/9+((1+Assumptions!$B$6)-1)*(1-($L$4-K9)/9)),0)","v":3.3730000000000038E-2},2.3392700000000044E-2]
[null,{"$f":"MIN(IF(B9+1=4,5,IF(B9+1=8,9,IF(B9+1=12,13,B9+1))),Inputs!$G$31)","v":14},{"$f":"VLOOKUP(B10,Inputs!$G$4:$H$77,2,FALSE)","v":57546},{"$f":"Inputs!$B$8*26.09","v":0},{"$f":"Inputs!$B$9*26.09","v":0},{"$f":"IF(L10>=34,Inputs!$K$4,0)","v":0},57546,{"$f":"Inputs!$B$12*26.09*Assumptions!$B$9*M10/$G$7","v":1219.9784976926605},null,null,31,9.6805555555555571,{"$f":"IFERROR((G10)*(1+Assumptions!$B$3)^(K10-K$7),0)","v":59592.606244613613},{"$f":"IFERROR(Inputs!$B$19*52.18*(1+Assumptions!$B$4)^(K10-K$7),0)","v":13417.080713367566},50179.8818679947,{"$f":"IFERROR((MIN(M10,O10)*Inputs!$B$16+MAX(0,M10-O10)*Inputs!$B$17)*Inputs!$B$6,0)","v":408.70236954210566},{"$f":"IFERROR((M10*Inputs!$B$18*Inputs!$B$6),0)","v":2234.7227341730104},{"$f":"IFERROR(R9*(1+Assumptions!$B$2)+P10,0)","v":2973.6677321550942},{"$f":"IFERROR(S9*(1+Assumptions!$B$2)+Q10,0)","v":18270.876450486903},{"$f":"T9*(1+Z9)","v":0},{"$f":"U9*(1+$Z9)+H10*(1+$Z9)^0.5","v":3593.2268023019024},null,null,0.01,{"$f":"MAX(IF(($L$4-K10)>=9,((1+Assumptions!$B$5)-1),((1+Assumptions!$B$5)-1)*($L$4-K10)/9+((1+Assumptions!$B$6)-1)*(1-($L$4-K10)/9)),0)","v":3.3730000000000038E-2},2.3392700000000044E-2]
{"$rows_left_out":60}
{"sheet":"Output","index":5,"n_rows":34,"n_cols":5,"rows_kept":34,"cut":false,"hidden":false,"merged":[[1,0,1,4],[11,0,11,4],[19,0,19,1],[25,0,25,1],[30,0,30,1]]}
["Single Public Service Pension Scheme at Normal Retirement Age"]
["Output"]
[null,"Current Day Value"]
["Scheme Pension",{"$f":"VLOOKUP(65,'Contributions & benefits at NRA'!$K$7:$AD$69,8,FALSE)*(1+Assumptions!$B$2)^('Contributions & benefits at NRA'!$K$7-'Contributions & benefits at NRA'!$L$3)","v":20838.871904218478},"equivalent to",{"$f":"B4/(VLOOKUP(66,'Contributions & benefits at NRA'!$K$7:$AD$69,3,FALSE)*Inputs!$B$6*(1+Assumptions!$B$2)^('Contributions & benefits at NRA'!$K$7-66))","v":0.28452467749236737},"of retiring salary"]
["State Contributory Pension",{"$f":"Inputs!B19*52.18","v":12956.294},"equivalent to",{"$f":"B5/(VLOOKUP(66,'Contributions & benefits at NRA'!$K$7:$AD$69,3,FALSE)*Inputs!$B$6*(1+Assumptions!$B$2)^('Contributions & benefits at NRA'!$K$7-66))","v":0.17689946887672206},"of retiring salary"]
["Total Pension",{"$f":"B5+B4","v":33795.165904218476},"equivalent to",{"$f":"D5+D4","v":0.46142414636908946},"of retiring salary"]
["PLUS"]
["Scheme Lump Sum",{"$f":"VLOOKUP(65,'Contributions & benefits at NRA'!$K$7:$AD$69,9,FALSE)*(1+Assumptions!$B$2)^('Contributions & benefits at NRA'!$K$7-'Contributions & benefits at NRA'!$L$3)","v":104037.76543396385},"equivalent to",{"$f":"B8/(VLOOKUP(66,'Contributions & benefits at NRA'!$K$7:$AD$69,3,FALSE)*Inputs!$B$6*(1+Assumptions!$B$2)^('Contributions & benefits at NRA'!$K$7-66))","v":1.4204853215270661},"of retiring salary"]
["Excludes the Current Value of AVCs input"]
[]
{"$rows_left_out":25}
{"sheet":"PDF","index":6,"n_rows":195,"n_cols":3,"rows_kept":195,"cut":false,"hidden":false,"merged":[[4,0,4,2],[7,0,7,2],[22,1,22,2],[61,1,61,2],[5,0,5,2],[58,1,58,2],[14,0,14,2],[49,0,49,2],[82,0,82,2],[156,0,156,2],[185,0,185,2],[46,0,46,1],[79,0,79,1]]}
[]
[]
[]
[]
["Single Public Service Pension Scheme Estimator"]
["for Primary Teachers"]
[]
["Your Projected Single Public Service Pension Scheme Retirement Benefits"]
[]
[]
{"$rows_left_out":186}
{"sheet":"Accrued benefits","index":7,"n_rows":69,"n_cols":22,"rows_kept":69,"cut":false,"hidden":false,"merged":[[59,4,59,5],[65,4,65,5],[3,4,3,5],[14,4,14,5],[25,4,25,5],[35,4,35,5],[44,4,44,5],[52,4,52,5]]}
["Data taken from spreadsheet:","Comparison of Earnings 2021 Pay Deal rak"]
["1/3 portion applied to full year"]
["DOB",{"$f":"Inputs!$B$3","v":"1992-05-06"},null,null,null,null,null,null,null,"Link"]
["Starting position \n","Point on scale","Total Pensionable Salary","Age","State pension",null,"3.74* State pension","Annual pension accrual","Annual lump sum accrual","Uprating in the 12 months to end of year","Cumulative pension","Cumulative lump sum",null,"Year of Joining","Cumulative pension","Cumulative lump sum","RAK Figs","Join Date","Accrued Pension to 31/12/2020","Accrued Lump Sum to 31/12/2020","Compare"]
["2013-09-01",null,null,null,null,null,null,null,null,null,0,0,null,2013,{"$f":"K13","v":1642.7344751129754},{"$f":"L13","v":10602.53070673301},null,"New entrant starting 1/9/2013",1647.5426985914589,10652.215723651674,{"$f":"S5/O5","v":1.0029269632745443},{"$f":"T5/P5","v":1.0046861469485877}]
["1/9/13 to 31/8/14",1,30702,{"$f":"28","v":28},230.3,{"$f":"E6*52.18","v":12017.054},{"$f":"F6*3.74","v":44943.78196},{"$f":"MIN(C6,G6)*Inputs!$B$16+MAX(0,C6-G6)*Inputs!$B$17","v":178.07159999999999},{"$f":"C6*Inputs!$B$18","v":1151.325},0,{"$f":"K5+H6*(D7-D6)","v":178.07159999999999},{"$f":"L5+I6*(D7-D6)","v":1151.325},null,2014,{"$f":"K23","v":1403.1937424620435},{"$f":"L23","v":9072.3733348839032},null,"New entrant starting 1/9/2014",1403.1756279752246,9072.2562153570561,{"$f":"S6/O6","v":0.9999870905305015},0.99998709053050139]
["1/9/14 to 31/8/15",2,33168,{"$f":"ROUND(D6+1,0)","v":29},230.3,{"$f":"E7*52.18","v":12017.054},{"$f":"F7*3.74","v":44943.78196},{"$f":"MIN(C7,G7)*Inputs!$B$16+MAX(0,C7-G7)*Inputs!$B$17","v":192.37439999999998},{"$f":"C7*Inputs!$B$18","v":1243.8},1E-3,{"$f":"K6*(4/12*(1+J6)+8/12*(1+J7))+H7","v":370.56471439999996},{"$f":"L6*(4/12*(1+J6)+8/12*(1+J7))+I7","v":2395.89255},null,2015,{"$f":"K33","v":1183.8300493928843},{"$f":"L33","v":7654.0735952126124},null,"New entrant starting 1/9/2015",1184.2754227825742,7656.9531645425059,1.0003762139590209,1.0003762139590211]
["1/9/15 to 31/8/16","2,3",33754.5,{"$f":"ROUND(D7+1,0)","v":30},230.3,12017.054,44943.78196,{"$f":"MIN(C8,G8)*Inputs!$B$16+MAX(0,C8-G8)*Inputs!$B$17","v":195.77609999999999},{"$f":"C8*Inputs!$B$18","v":1265.79375},0,{"$f":"K7*(4/12*(1+J7)+8/12*(1+J8))+H8","v":566.46433597146665},{"$f":"L7*(4/12*(1+J7)+8/12*(1+J8))+I8","v":3662.4849308499997},null,2016,{"$f":"K42","v":966.38353435190777},{"$f":"L42","v":6248.1694031373336},null,"New entrant starting 1/9/2016",966.37557754960903,6248.1179582948853,0.99999176641362786,0.99999176641362786]
["1/9/16 to 31/8/17","3,4",36736,31,233.3,12173.594000000001,45529.241560000009,{"$f":"MIN(C9,G9)*Inputs!$B$16+MAX(0,C9-G9)*Inputs!$B$17","v":213.06879999999998},{"$f":"C9*Inputs!$B$18","v":1377.6},4.0000000000000001E-3,781.04370753405715,5049.8515573322657,null,2017,{"$f":"K50","v":745.11666462543917},{"$f":"L50","v":4817.5646419748227},null,"New entrant starting 1/9/2017",745.1130950875654,4817.5415630661555,0.99999520942418385,0.99999520942418374]
["1/9/17 to 31/8/18","4,5",40232.724999999991,32,238.3,12434.494000000001,46505.007560000005,{"$f":"MIN(C10,G10)*Inputs!$B$16+MAX(0,C10-G10)*Inputs!$B$17","v":233.34980499999995},{"$f":"C10*Inputs!$B$18","v":1508.7271874999997},7.0000000000000001E-3,1019.0797747792612,6588.8778541762576,null,2018,{"$f":"K57","v":513.60944350447028},{"$f":"L57","v":3320.7507123133851},null,"New entrant starting 1/9/2018",513.60944350447016,3320.7507123133855,0.99999999999999978,1.0000000000000002]
{"$rows_left_out":59}